Reaction Details
TargetHigh affinity nerve growth factor receptor
LigandBDBM127682
Substrate/Competitorn/a
Meas. Tech.ELISA Assay
pH7.5±n/a
IC50 1±n/a nM
Commentsextracted
Citation Allen, SAndrews, SWCondroski, KRHaas, JHuang, LJiang, YKercher, TSeo, J Substituted pyrazolo[1,5-a]pyrimidine compounds as Trk kinase inhibitors US Patent US8791123 Publication Date 7/29/2014
 
High affinity nerve growth factor receptor
Name:High affinity nerve growth factor receptor
Type:n/a
Mol. Mass.:87498.18
Organism:Homo sapiens (Human)
Description:P04629
Residue:796
BDBM127682
NameBDBM127682
Synonyms:US8791123, 55 | US8791123, 56
TypeSmall organic molecule
Emp. Form.C21H24FN5O4
Mol. Mass.429.4448
SMILESOCC(O)CNC(=O)c1cnn2ccc(nc12)N1CCCC1c1cc(F)ccc1CO