Reaction Details
TargetHigh affinity nerve growth factor receptor
LigandBDBM127691
Substrate/Competitorn/a
Meas. Tech.ELISA Assay
pH7.5±n/a
IC50 1.6±n/a nM
Commentsextracted
Citation Allen, SAndrews, SWCondroski, KRHaas, JHuang, LJiang, YKercher, TSeo, J Substituted pyrazolo[1,5-a]pyrimidine compounds as Trk kinase inhibitors US Patent US8791123 Publication Date 7/29/2014
 
High affinity nerve growth factor receptor
Name:High affinity nerve growth factor receptor
Type:n/a
Mol. Mass.:87498.18
Organism:Homo sapiens (Human)
Description:P04629
Residue:796
BDBM127691
NameBDBM127691
Synonyms:US10251889, Example 64 US8791123, 64 US9796724, Example 64
TypeSmall organic molecule
Emp. Form.C18H15F4N5O
Mol. Mass.393.3382
SMILESNC(=O)c1cnn2ccc(nc12)N1CCC[C@@H]1c1cc(F)ccc1C(F)(F)F