Reaction Details
TargetHigh affinity nerve growth factor receptor
LigandBDBM127706
Substrate/Competitorn/a
Meas. Tech.ELISA Assay
pH7.5±n/a
IC50 1.3±n/a nM
Commentsextracted
Citation Allen, SAndrews, SWCondroski, KRHaas, JHuang, LJiang, YKercher, TSeo, J Substituted pyrazolo[1,5-a]pyrimidine compounds as Trk kinase inhibitors US Patent US8791123 Publication Date 7/29/2014
 
High affinity nerve growth factor receptor
Name:High affinity nerve growth factor receptor
Type:n/a
Mol. Mass.:87498.18
Organism:Homo sapiens (Human)
Description:P04629
Residue:796
BDBM127706
NameBDBM127706
Synonyms:US8791123, 79
TypeSmall organic molecule
Emp. Form.C20H21FN6O2
Mol. Mass.396.4181
SMILESOCc1ncc(F)cc1C1CCCN1c1ccn2ncc(C(=O)NC3CC3)c2n1