Reaction Details
TargetHigh affinity nerve growth factor receptor
LigandBDBM127717
Substrate/Competitorn/a
Meas. Tech.ELISA Assay
pH7.5±n/a
IC50 0.95±n/a nM
Commentsextracted
Citation Allen, SAndrews, SWCondroski, KRHaas, JHuang, LJiang, YKercher, TSeo, J Substituted pyrazolo[1,5-a]pyrimidine compounds as Trk kinase inhibitors US Patent US8791123 Publication Date 7/29/2014
 
High affinity nerve growth factor receptor
Name:High affinity nerve growth factor receptor
Type:n/a
Mol. Mass.:87498.18
Organism:Homo sapiens (Human)
Description:P04629
Residue:796
BDBM127717
NameBDBM127717
Synonyms:US10251889, Example 90 US8791123, 90 US9796724, Example 90
TypeSmall organic molecule
Emp. Form.C23H26FN5O3
Mol. Mass.439.4826
SMILESCOCCOc1ccc(F)cc1[C@H]1CCCN1c1ccn2ncc(C(=O)NC3CC3)c2n1