Reaction Details
TargetHigh affinity nerve growth factor receptor
LigandBDBM127778
Substrate/Competitorn/a
Meas. Tech.ELISA Assay
pH7.5±n/a
IC50 1.4±n/a nM
Commentsextracted
Citation Allen, SAndrews, SWCondroski, KRHaas, JHuang, LJiang, YKercher, TSeo, J Substituted pyrazolo[1,5-a]pyrimidine compounds as Trk kinase inhibitors US Patent US8791123 Publication Date 7/29/2014
 
High affinity nerve growth factor receptor
Name:High affinity nerve growth factor receptor
Type:n/a
Mol. Mass.:87498.18
Organism:Homo sapiens (Human)
Description:P04629
Residue:796
BDBM127778
NameBDBM127778
Synonyms:US10251889, Example 151 US8791123, 151 US9796724, Example 151
TypeSmall organic molecule
Emp. Form.C21H25FN6O3
Mol. Mass.428.46
SMILESCOc1ncc(F)cc1[C@H]1CCCN1c1ccn2ncc(C(=O)NCCCCO)c2n1