Reaction Details
TargetHigh affinity nerve growth factor receptor
LigandBDBM127796
Substrate/Competitorn/a
Meas. Tech.ELISA Assay
pH7.5±n/a
IC50 0.9±n/a nM
Commentsextracted
Citation Allen, SAndrews, SWCondroski, KRHaas, JHuang, LJiang, YKercher, TSeo, J Substituted pyrazolo[1,5-a]pyrimidine compounds as Trk kinase inhibitors US Patent US8791123 Publication Date 7/29/2014
 
High affinity nerve growth factor receptor
Name:High affinity nerve growth factor receptor
Type:n/a
Mol. Mass.:87498.18
Organism:Homo sapiens (Human)
Description:P04629
Residue:796
BDBM127796
NameBDBM127796
Synonyms:US10251889, Example 169 US8791123, 169 US9796724, Example 169
TypeSmall organic molecule
Emp. Form.C22H23F2N5O2
Mol. Mass.427.4471
SMILESO[C@H]1CC[C@@H](C1)NC(=O)c1cnn2ccc(nc12)N1CCC[C@@H]1c1cc(F)ccc1F