Reaction Details
TargetHigh affinity nerve growth factor receptor
LigandBDBM127835
Substrate/Competitorn/a
Meas. Tech.ELISA Assay
pH7.5±n/a
IC50 1.7±n/a nM
Commentsextracted
Citation Allen, SAndrews, SWCondroski, KRHaas, JHuang, LJiang, YKercher, TSeo, J Substituted pyrazolo[1,5-a]pyrimidine compounds as Trk kinase inhibitors US Patent US8791123 Publication Date 7/29/2014
 
High affinity nerve growth factor receptor
Name:High affinity nerve growth factor receptor
Type:n/a
Mol. Mass.:87498.18
Organism:Homo sapiens (Human)
Description:P04629
Residue:796
BDBM127835
NameBDBM127835
Synonyms:US10251889, Example 208 US8791123, 208 US9796724, Example 208
TypeSmall organic molecule
Emp. Form.C23H26FN5O4
Mol. Mass.455.482
SMILESOCC(O)COc1cc(F)cc(c1)[C@H]1CCCN1c1ccn2ncc(C(=O)NC3CC3)c2n1