Reaction Details
TargetE3 ubiquitin-protein ligase Mdm2
LigandBDBM130035
Substrate/Competitorn/a
Meas. Tech.Time Resolved Fluorescence Energy Transfer (TR-FRET) Assay
IC50 0.089±n/a nM
Citation Furet, PGuagnano, VHolzer, PKallen, JLiao, LMah, RMao, LMasuya, KSchlapbach, AStutz, SVaupel, A Substituted pyrrolo[3,4-D]imidazoles for the treatment of MDM2/4 mediated diseases US Patent US8815926 Publication Date 8/26/2014
 
E3 ubiquitin-protein ligase Mdm2
Name:E3 ubiquitin-protein ligase Mdm2
Type:Oncoprotein
Mol. Mass.:55196.54
Organism:Homo sapiens (Human)
Description:Q00987
Residue:491
BDBM130035
NameBDBM130035
Synonyms:US8815926, 317
TypeSmall organic molecule
Emp. Form.C27H24Cl2FN5O4
Mol. Mass.572.415
SMILESCOC[C@@H](C)n1c(nc2C(=O)N([C@H](c12)c1ccc(Cl)cc1)c1ccc(F)c(Cl)c1)-c1cnc(OC)nc1OC