Reaction Details
TargetProtein Mdm4
LigandBDBM129739
Substrate/Competitorn/a
Meas. Tech.Time Resolved Fluorescence Energy Transfer (TR-FRET) Assay
IC50 340±n/a nM
Citation Furet, PGuagnano, VHolzer, PKallen, JLiao, LMah, RMao, LMasuya, KSchlapbach, AStutz, SVaupel, A Substituted pyrrolo[3,4-D]imidazoles for the treatment of MDM2/4 mediated diseases US Patent US8815926 Publication Date 8/26/2014
 
Protein Mdm4
Name:Protein Mdm4
Type:Oncoprotein
Mol. Mass.:54842.04
Organism:Homo sapiens (Human)
Description:The HDMX(1-188) were expressed in Escherichia coli BL21 (DE3) as a GST fusion and purified on glutathione sepharose.
Residue:490
BDBM129739
NameBDBM129739
Synonyms:US8815926, 18
TypeSmall organic molecule
Emp. Form.C30H29Cl2N3O3
Mol. Mass.550.476
SMILESCOc1ccc(CO)cc1-c1nc2C(=O)N(C(c2n1C(C)C)c1ccc(Cl)cc1C)c1cc(Cl)ccc1C