Reaction Details
TargetPlasma kallikrein
LigandBDBM285517
Substrate/Competitorn/a
Meas. Tech.Determination of the Plasma Kallikrein Activity
pH7.4±n/a
Temperature298.15±n/a K
IC50 0.800±n/a nM
Commentsextracted
Citation Röhrig, SHillisch, AStraβburger, JHeitmeier, SSchmidt, MVSchlemmer, KTersteegen, ABuchmüller, AGerdes, CSchäfer, MTeller, HJiménez Núnez, ESchirok, HKlar, JLobell, M Substituted oxopyridine derivatives US Patent US10077265 Publication Date 9/18/2018
 
Plasma kallikrein
Name:Plasma kallikrein
Type:Protein
Mol. Mass.:71391.16
Organism:Homo sapiens (Human)
Description:P03952
Residue:638
BDBM285517
NameBDBM285517
Synonyms:5-({2-[4-(5-Chloro-2-cyanophenyl)-5-methoxy-2-oxopyridin-1(2H)-yl]-4-methoxybutanoyl}amino)pyrazolo[1,5-a]pyridine-3-carboxamide (racemate) US10077265, Example 5
TypeSmall organic molecule
Emp. Form.C26H23ClN6O5
Mol. Mass.534.951
SMILESCOCCC(C(=O)Nc1ccn2ncc(C(N)=O)c2c1)n1cc(OC)c(cc1=O)-c1cc(Cl)ccc1C#N