Reaction Details
TargetCannabinoid receptor 2
LigandBDBM135902
Substrate/Competitorn/a
Meas. Tech.Radioligand Binding Assay
pH7.4±n/a
Temperature303.15±n/a K
Ki 1.7±n/a nM
Commentsextracted
Citation Carroll, WADart, MJFrost, JMLatshaw, SPKolasa, TLi, TPeddi, SLiu, BPerez-Medrano, APatel, MWang, XNelson, DW Compounds as cannabinoid receptor ligands US Patent US8859596 Publication Date 10/14/2014
 
Cannabinoid receptor 2
Name:Cannabinoid receptor 2
Type:G Protein-Coupled Receptor (GPCR)
Mol. Mass.:39690.94
Organism:Homo sapiens (Human)
Description:P34972
Residue:360
BDBM135902
NameBDBM135902
Synonyms:US8859596, 190
TypeSmall organic molecule
Emp. Form.C23H29F3N4O2S
Mol. Mass.482.562
SMILESCCCCn1nc(s\c1=N/C(=O)c1cc(ccc1ON=C1CCCC1)C(F)(F)F)C(C)(C)C