Reaction Details
TargetCannabinoid receptor 2
LigandBDBM135905
Substrate/Competitorn/a
Meas. Tech.Radioligand Binding Assay
pH7.4±n/a
Temperature303.15±n/a K
Ki 0.4±n/a nM
Commentsextracted
Citation Carroll, WADart, MJFrost, JMLatshaw, SPKolasa, TLi, TPeddi, SLiu, BPerez-Medrano, APatel, MWang, XNelson, DW Compounds as cannabinoid receptor ligands US Patent US8859596 Publication Date 10/14/2014
 
Cannabinoid receptor 2
Name:Cannabinoid receptor 2
Type:G Protein-Coupled Receptor (GPCR)
Mol. Mass.:39690.94
Organism:Homo sapiens (Human)
Description:P34972
Residue:360
BDBM135905
NameBDBM135905
Synonyms:US8859596, 193
TypeSmall organic molecule
Emp. Form.C23H32F3N5O2S
Mol. Mass.499.593
SMILESCCCCn1nc(s\c1=N/C(=O)c1cc(ccc1NNC(=O)C(C)(C)C)C(F)(F)F)C(C)(C)C