Reaction Details
TargetCannabinoid receptor 2
LigandBDBM135888
Substrate/Competitorn/a
Meas. Tech.Radioligand Binding Assay
pH7.4±n/a
Ki 1.7±n/a nM
Commentsextracted
Citation Carroll, WADart, MJFrost, JMLatshaw, SPKolasa, TLi, TPeddi, SLiu, BPerez-Medrano, APatel, MWang, XNelson, DW Compounds as cannabinoid receptor ligands US Patent US8859596 Publication Date 10/14/2014
 
Cannabinoid receptor 2
Name:Cannabinoid receptor 2
Type:Enzyme
Mol. Mass.:39366.68
Organism:Rattus norvegicus (Rat)
Description:Q9QZN9
Residue:360
BDBM135888
NameBDBM135888
Synonyms:US8859596, 176
TypeSmall organic molecule
Emp. Form.C22H28F3N5O4S
Mol. Mass.515.549
SMILESCCCCn1nc(s\c1=N\C(=O)c1cc(ccc1ON=C(CC)C(=O)ON)C(F)(F)F)C(C)(C)C