Reaction Details
TargetCannabinoid receptor 2
LigandBDBM139906
Substrate/Competitorn/a
Meas. Tech.Radioligand Binding Assays
Ki 1.6±n/a nM
Citation Frost, JMLatshaw, SPDart, MJCarroll, WAPerez-Medrano, AKolasa, TPatel, MVNelson, DWLi, TPeddi, SWang, XLiu, B Compounds as cannabinoid receptor ligands US Patent US8895592 Publication Date 11/25/2014
 
Cannabinoid receptor 2
Name:Cannabinoid receptor 2
Type:G Protein-Coupled Receptor (GPCR)
Mol. Mass.:39690.94
Organism:Homo sapiens (Human)
Description:P34972
Residue:360
BDBM139906
NameBDBM139906
Synonyms:US8895592, 37
TypeSmall organic molecule
Emp. Form.C25H28F3N5O2S
Mol. Mass.519.582
SMILESCCCCn1cc(s\c1=N/C(=O)c1cc(ccc1NNC(=O)c1cccnc1)C(F)(F)F)C(C)(C)C