Reaction Details
TargetCannabinoid receptor 2
LigandBDBM139885
Substrate/Competitorn/a
Meas. Tech.Radioligand Binding Assays
Ki 1.1±n/a nM
Citation Frost, JMLatshaw, SPDart, MJCarroll, WAPerez-Medrano, AKolasa, TPatel, MVNelson, DWLi, TPeddi, SWang, XLiu, B Compounds as cannabinoid receptor ligands US Patent US8895592 Publication Date 11/25/2014
 
Cannabinoid receptor 2
Name:Cannabinoid receptor 2
Type:Enzyme
Mol. Mass.:39366.68
Organism:Rattus norvegicus (Rat)
Description:Q9QZN9
Residue:360
BDBM139885
NameBDBM139885
Synonyms:US8895592, 15
TypeSmall organic molecule
Emp. Form.C21H27ClN2O2S
Mol. Mass.406.969
SMILESCC(C)Cn1cc(s\c1=N/C(=O)c1cc(Cl)ccc1OC1CC1)C(C)(C)C