Reaction Details
TargetCannabinoid receptor 2
LigandBDBM139888
Substrate/Competitorn/a
Meas. Tech.Radioligand Binding Assays
Ki 1.4±n/a nM
Citation Frost, JMLatshaw, SPDart, MJCarroll, WAPerez-Medrano, AKolasa, TPatel, MVNelson, DWLi, TPeddi, SWang, XLiu, B Compounds as cannabinoid receptor ligands US Patent US8895592 Publication Date 11/25/2014
 
Cannabinoid receptor 2
Name:Cannabinoid receptor 2
Type:Enzyme
Mol. Mass.:39366.68
Organism:Rattus norvegicus (Rat)
Description:Q9QZN9
Residue:360
BDBM139888
NameBDBM139888
Synonyms:US8895592, 18
TypeSmall organic molecule
Emp. Form.C23H29F3N2O4S
Mol. Mass.486.548
SMILESCC(C)Cn1cc(s\c1=N/C(=O)c1cc(ccc1OCCOC(C)=O)C(F)(F)F)C(C)(C)C