Reaction Details
TargetFibroblast growth factor 2
LigandBDBM142236
Substrate/Competitorn/a
Meas. Tech.ADP-Glo Kinase Assay
Temperature298.15±n/a K
IC50 6.4±n/a nM
Commentsextracted
Citation Funasaka, SOkada, TTanaka, KNagao, SOhashi, IYamane, YNakatani, YKaroji, Y Monocyclic pyridine derivative US Patent US8933099 Publication Date 1/13/2015
 
Fibroblast growth factor 2
Name:Fibroblast growth factor 2
Type:Protein
Mol. Mass.:30803.89
Organism:Homo sapiens (Human)
Description:P09038
Residue:288
BDBM142236
NameBDBM142236
Synonyms:US8933099, 2
TypeSmall organic molecule
Emp. Form.C30H33N5O4
Mol. Mass.527.6141
SMILESCCN1CCC(CC1)c1ccc(cc1)C(=O)Nc1cc(Oc2cc3ccn(C(=O)NC)c3cc2OC)ccn1