Reaction Details
TargetCasein kinase II subunit alpha
LigandBDBM142775
Substrate/Competitorn/a
Meas. Tech.Kinase Assay
pH7.4±n/a
Temperature303.15±n/a K
IC50 0.17±n/a nM
Commentsextracted
Citation Purandare, AVFink, BEGavai, AVJohnson, WLHart, ACHe, LHuynh, TNInghrim, JMastalerz, HSang, XTarby, CMWan, HVaccaro, WZhang, GZhao, YZimmermann, K Imidazotriazinecarbonitriles useful as kinase inhibitors US Patent US8940736 Publication Date 1/27/2015
 
Casein kinase II subunit alpha
Name:Casein kinase II subunit alpha
Type:Enzyme
Mol. Mass.:45151.12
Organism:Homo sapiens (Human)
Description:P68400
Residue:391
BDBM142775
NameBDBM142775
Synonyms:US8940736, 7
TypeSmall organic molecule
Emp. Form.C20H18ClN9O
Mol. Mass.435.87
SMILESOC1CCN(C1)c1cc(cc(Nc2nc(NC3CC3)c3ncc(C#N)n3n2)c1Cl)C#N