Reaction Details
TargetCasein kinase II subunit alpha
LigandBDBM142818
Substrate/Competitorn/a
Meas. Tech.Kinase Assay
pH7.4±n/a
Temperature303.15±n/a K
IC50 0.29±n/a nM
Commentsextracted
Citation Purandare, AVFink, BEGavai, AVJohnson, WLHart, ACHe, LHuynh, TNInghrim, JMastalerz, HSang, XTarby, CMWan, HVaccaro, WZhang, GZhao, YZimmermann, K Imidazotriazinecarbonitriles useful as kinase inhibitors US Patent US8940736 Publication Date 1/27/2015
 
Casein kinase II subunit alpha
Name:Casein kinase II subunit alpha
Type:Enzyme
Mol. Mass.:45151.12
Organism:Homo sapiens (Human)
Description:P68400
Residue:391
BDBM142818
NameBDBM142818
Synonyms:US8940736, 313
TypeSmall organic molecule
Emp. Form.C24H24ClFN10O
Mol. Mass.522.965
SMILESFC1CN(CCN(C1)c1cc(cc(Nc2nc(NC3CC3)c3ncc([N+]#[C-])n3n2)c1Cl)C#N)C1COC1