Reaction Details
TargetCasein kinase II subunit alpha'
LigandBDBM142784
Substrate/Competitorn/a
Meas. Tech.Kinase Assay
pH7.4±n/a
Temperature303.15±n/a K
IC50 0.15±n/a nM
Commentsextracted
Citation Purandare, AVFink, BEGavai, AVJohnson, WLHart, ACHe, LHuynh, TNInghrim, JMastalerz, HSang, XTarby, CMWan, HVaccaro, WZhang, GZhao, YZimmermann, K Imidazotriazinecarbonitriles useful as kinase inhibitors US Patent US8940736 Publication Date 1/27/2015
 
Casein kinase II subunit alpha'
Name:Casein kinase II subunit alpha'
Type:Protein
Mol. Mass.:41223.82
Organism:Homo sapiens (Human)
Description:n/a
Residue:350
BDBM142784
NameBDBM142784
Synonyms:US8940736, 117
TypeSmall organic molecule
Emp. Form.C25H27ClN10O2S
Mol. Mass.567.066
SMILESClc1c(Nc2nc(NC3CC3)c3ncc(C#N)n3n2)cc(cc1N1CCC(CC1)NC1CCS(=O)(=O)C1)C#N