Reaction Details
TargetCasein kinase II subunit alpha'
LigandBDBM142831
Substrate/Competitorn/a
Meas. Tech.Kinase Assay
pH7.4±n/a
Temperature303.15±n/a K
IC50 0.27±n/a nM
Commentsextracted
Citation Purandare, AVFink, BEGavai, AVJohnson, WLHart, ACHe, LHuynh, TNInghrim, JMastalerz, HSang, XTarby, CMWan, HVaccaro, WZhang, GZhao, YZimmermann, K Imidazotriazinecarbonitriles useful as kinase inhibitors US Patent US8940736 Publication Date 1/27/2015
 
Casein kinase II subunit alpha'
Name:Casein kinase II subunit alpha'
Type:Protein
Mol. Mass.:41223.82
Organism:Homo sapiens (Human)
Description:n/a
Residue:350
BDBM142831
NameBDBM142831
Synonyms:US8940736, 394
TypeSmall organic molecule
Emp. Form.C24H27N11O
Mol. Mass.485.5443
SMILESCCNc1nc(Nc2ccc3n(nc(C#N)c3c2)C2CCN(C[C@H](C)O)CC2)nn2c(cnc12)C#N