Reaction Details
TargetMetallo-beta-lactamase VIM-2
LigandBDBM153701
Substrate/Competitorn/a
Meas. Tech.Direct Competition Assay
Ki 1.4e+4± 1e+3 nM
Citation Mojica, MFMahler, SGBethel, CRTaracila, MAKosmopoulou, MPapp-Wallace, KMLlarrull, LIWilson, BMMarshall, SHWallace, CJVillegas, MVHarris, MEVila, AJSpencer, JBonomo, RA Exploring the Role of Residue 228 in Substrate and Inhibitor Recognition by VIM Metallo-ß-lactamases. Biochemistry54:3183-96 (2015) 
 
Metallo-beta-lactamase VIM-2
Name:Metallo-beta-lactamase VIM-2
Type:Protein
Mol. Mass.:28318.00
Organism:Pseudomonas aeruginosa (g-Proteobacteria)
Description:n/a
Residue:266
BDBM153701
NameBDBM153701
Synonyms:D-VC26
TypeSmall organic molecule
Emp. Form.C9H15NO2S3
Mol. Mass.265.416
SMILESCC1(C)S[C@@H]2CS[C@@H](CS)N2[C@H]1C(O)=O