Reaction Details
TargetChromobox protein homolog 7
LigandBDBM154547
Substrate/Competitorn/a
Meas. Tech.AlphaScreen Assay
pH8±0
Temperature1937.05±0 K
IC50>1.00e+5±n/a nM
Citation Perfetti, MTBaughman, BMDickson, BMMu, YCui, GMader, PDong, ANorris, JLRothbart, SBStrahl, BDBrown, PJJanzen, WPArrowsmith, CHMer, GMcBride, KMJames, LIFrye, SV Identification of a fragment-like small molecule ligand for the methyl-lysine binding protein, 53BP1. ACS Chem Biol10:1072-81 (2015) 
 
Chromobox protein homolog 7
Name:Chromobox protein homolog 7
Type:Protein
Mol. Mass.:28351.76
Organism:Homo sapiens (Human)
Description:n/a
Residue:251
BDBM154547
NameBDBM154547
Synonyms:3-Bromo-N-(3-(isopropylamino)propyl)benzamide (3)
TypeSmall organic molecule
Emp. Form.C13H19BrN2O
Mol. Mass.299.207
SMILESCC(C)NCCCNC(=O)c1cccc(Br)c1