Reaction Details
TargetPHD finger protein 19
LigandBDBM154547
Substrate/Competitorn/a
Meas. Tech.AlphaScreen Assay
pH8±0
Temperature1937.05±0 K
IC50 6.1e+4± 9e+2 nM
Citation Perfetti, MTBaughman, BMDickson, BMMu, YCui, GMader, PDong, ANorris, JLRothbart, SBStrahl, BDBrown, PJJanzen, WPArrowsmith, CHMer, GMcBride, KMJames, LIFrye, SV Identification of a fragment-like small molecule ligand for the methyl-lysine binding protein, 53BP1. ACS Chem Biol10:1072-81 (2015) 
 
PHD finger protein 19
Name:PHD finger protein 19
Type:Protein
Mol. Mass.:65617.90
Organism:Homo sapiens (Human)
Description:n/a
Residue:580
BDBM154547
NameBDBM154547
Synonyms:3-Bromo-N-(3-(isopropylamino)propyl)benzamide (3)
TypeSmall organic molecule
Emp. Form.C13H19BrN2O
Mol. Mass.299.207
SMILESCC(C)NCCCNC(=O)c1cccc(Br)c1