Reaction Details
TargetPHD finger protein 23
LigandBDBM154545
Substrate/Competitorn/a
Meas. Tech.AlphaScreen Assay
pH8±0
Temperature1937.05±0 K
IC50>5.00e+5±n/a nM
Citation Perfetti, MTBaughman, BMDickson, BMMu, YCui, GMader, PDong, ANorris, JLRothbart, SBStrahl, BDBrown, PJJanzen, WPArrowsmith, CHMer, GMcBride, KMJames, LIFrye, SV Identification of a fragment-like small molecule ligand for the methyl-lysine binding protein, 53BP1. ACS Chem Biol10:1072-81 (2015) 
 
PHD finger protein 23
Name:PHD finger protein 23
Type:Protein
Mol. Mass.:43813.67
Organism:Homo sapiens (Human)
Description:n/a
Residue:403
BDBM154545
NameBDBM154545
Synonyms:3-Bromo-N-(3-(tert-butylamino)propyl)benzamide (UNC2170, 1)
TypeSmall organic molecule
Emp. Form.C14H21BrN2O
Mol. Mass.313.233
SMILESCC(C)(C)NCCCNC(=O)c1cccc(Br)c1