Reaction Details
TargetE3 ubiquitin-protein ligase UHRF1
LigandBDBM154549
Substrate/Competitorn/a
Meas. Tech.AlphaScreen Assay
pH8±0
Temperature1937.05±0 K
IC50>1.00e+5±n/a nM
Citation Perfetti, MTBaughman, BMDickson, BMMu, YCui, GMader, PDong, ANorris, JLRothbart, SBStrahl, BDBrown, PJJanzen, WPArrowsmith, CHMer, GMcBride, KMJames, LIFrye, SV Identification of a fragment-like small molecule ligand for the methyl-lysine binding protein, 53BP1. ACS Chem Biol10:1072-81 (2015) 
 
E3 ubiquitin-protein ligase UHRF1
Name:E3 ubiquitin-protein ligase UHRF1
Type:Protein
Mol. Mass.:89822.48
Organism:Homo sapiens (Human)
Description:n/a
Residue:793
BDBM154549
NameBDBM154549
Synonyms:3-Bromo-N-(3-(tert-butoxy)propyl)benzamide (5)
TypeSmall organic molecule
Emp. Form.C14H20BrNO2
Mol. Mass.314.218
SMILESCC(C)(C)OCCCNC(=O)c1cccc(Br)c1