Reaction Details
TargetMBT domain-containing protein 1
LigandBDBM154550
Substrate/Competitorn/a
Meas. Tech.AlphaScreen Assay
pH8±0
Temperature1937.05±0 K
IC50 7.8e+4± 1.6e+4 nM
Citation Perfetti, MTBaughman, BMDickson, BMMu, YCui, GMader, PDong, ANorris, JLRothbart, SBStrahl, BDBrown, PJJanzen, WPArrowsmith, CHMer, GMcBride, KMJames, LIFrye, SV Identification of a fragment-like small molecule ligand for the methyl-lysine binding protein, 53BP1. ACS Chem Biol10:1072-81 (2015) 
 
MBT domain-containing protein 1
Name:MBT domain-containing protein 1
Type:Protein
Mol. Mass.:70557.67
Organism:Homo sapiens (Human)
Description:n/a
Residue:628
BDBM154550
NameBDBM154550
Synonyms:3-Bromo-N-(3-(pyrrolidin-1-yl)propyl)benzamide (6)
TypeSmall organic molecule
Emp. Form.C14H19BrN2O
Mol. Mass.311.217
SMILESBrc1cccc(c1)C(=O)NCCCN1CCCC1