Reaction Details
TargetLysine-specific demethylase 5A
LigandBDBM154552
Substrate/Competitorn/a
Meas. Tech.AlphaScreen Assay
pH8±0
Temperature1663.9±0 K
IC50>1.00e+5±n/a nM
Citation Perfetti, MTBaughman, BMDickson, BMMu, YCui, GMader, PDong, ANorris, JLRothbart, SBStrahl, BDBrown, PJJanzen, WPArrowsmith, CHMer, GMcBride, KMJames, LIFrye, SV Identification of a fragment-like small molecule ligand for the methyl-lysine binding protein, 53BP1. ACS Chem Biol10:1072-81 (2015) 
 
Lysine-specific demethylase 5A
Name:Lysine-specific demethylase 5A
Type:Protein
Mol. Mass.:192091.79
Organism:Homo sapiens (Human)
Description:P29375
Residue:1690
BDBM154552
NameBDBM154552
Synonyms:N1-(3-Bromobenzyl)-N3-(tert-butyl)propane-1,3-diamine (8)
TypeSmall organic molecule
Emp. Form.C14H23BrN2
Mol. Mass.299.25
SMILESCC(C)(C)NCCCNCc1cccc(Br)c1