Reaction Details
TargetE3 ubiquitin-protein ligase UHRF1
LigandBDBM154556
Substrate/Competitorn/a
Meas. Tech.AlphaScreen Assay
pH8±0
Temperature1663.9±0 K
IC50>1.00e+5±n/a nM
Citation Perfetti, MTBaughman, BMDickson, BMMu, YCui, GMader, PDong, ANorris, JLRothbart, SBStrahl, BDBrown, PJJanzen, WPArrowsmith, CHMer, GMcBride, KMJames, LIFrye, SV Identification of a fragment-like small molecule ligand for the methyl-lysine binding protein, 53BP1. ACS Chem Biol10:1072-81 (2015) 
 
E3 ubiquitin-protein ligase UHRF1
Name:E3 ubiquitin-protein ligase UHRF1
Type:Protein
Mol. Mass.:89822.48
Organism:Homo sapiens (Human)
Description:n/a
Residue:793
BDBM154556
NameBDBM154556
Synonyms:3-Bromo-N-(5-(tert-butylamino)pentyl)benzamide (12)
TypeSmall organic molecule
Emp. Form.C16H25BrN2O
Mol. Mass.341.286
SMILESCC(C)(C)NCCCCCNC(=O)c1cccc(Br)c1