Reaction Details
TargetPHD finger protein 1
LigandBDBM154566
Substrate/Competitorn/a
Meas. Tech.AlphaScreen Assay
pH8±0
Temperature1117.6±0 K
IC50>1.00e+5±n/a nM
Citation Perfetti, MTBaughman, BMDickson, BMMu, YCui, GMader, PDong, ANorris, JLRothbart, SBStrahl, BDBrown, PJJanzen, WPArrowsmith, CHMer, GMcBride, KMJames, LIFrye, SV Identification of a fragment-like small molecule ligand for the methyl-lysine binding protein, 53BP1. ACS Chem Biol10:1072-81 (2015) 
 
PHD finger protein 1
Name:PHD finger protein 1
Type:Protein
Mol. Mass.:62133.86
Organism:Homo sapiens (Human)
Description:O43189
Residue:567
BDBM154566
NameBDBM154566
Synonyms:N-(3-(Tert-butylamino)propyl)-4-(trifluoromethyl)benzamide (22)
TypeSmall organic molecule
Emp. Form.C15H21F3N2O
Mol. Mass.302.3352
SMILESCC(C)(C)NCCCNC(=O)c1ccc(cc1)C(F)(F)F