Reaction Details
TargetMBT domain-containing protein 1
LigandBDBM154561
Substrate/Competitorn/a
Meas. Tech.AlphaScreen Assay
pH8±0
Temperature844.45±0 K
IC50>1.00e+5±n/a nM
Citation Perfetti, MTBaughman, BMDickson, BMMu, YCui, GMader, PDong, ANorris, JLRothbart, SBStrahl, BDBrown, PJJanzen, WPArrowsmith, CHMer, GMcBride, KMJames, LIFrye, SV Identification of a fragment-like small molecule ligand for the methyl-lysine binding protein, 53BP1. ACS Chem Biol10:1072-81 (2015) 
 
MBT domain-containing protein 1
Name:MBT domain-containing protein 1
Type:Protein
Mol. Mass.:70557.67
Organism:Homo sapiens (Human)
Description:n/a
Residue:628
BDBM154561
NameBDBM154561
Synonyms:N-(3-(Tert-butylamino)propyl)-3-chlorobenzamide (17)
TypeSmall organic molecule
Emp. Form.C14H21ClN2O
Mol. Mass.268.782
SMILESCC(C)(C)NCCCNC(=O)c1cccc(Cl)c1