Reaction Details
TargetMitogen-activated protein kinase 1
LigandBDBM50437406
Substrate/Competitorn/a
Meas. Tech.IMAP-FP Assay
IC50 0.2223±n/a nM
Citation Lim, JKelley, EHMethot, JLZhou, HPetrocchi, AMansoor, UFFischer, CO'Boyle, BGuerin, DJBienstock, CEBoyce, CWDaniels, MHFalcone, DFerguson, RDFevrier, SHuang, XLipford, KASloman, DLWilson, KZhou, WWitter, DMaletic, MMSiliphaivanh, P Compounds that are ERK inhibitors US Patent US9023865 Publication Date 5/5/2015
 
Mitogen-activated protein kinase 1
Name:Mitogen-activated protein kinase 1
Type:Protein
Mol. Mass.:41278.65
Organism:Mus musculus (Mouse)
Description:P63085
Residue:358
BDBM50437406
NameBDBM50437406
Synonyms:CHEMBL2408788 | US9023865, 9
TypeSmall organic molecule
Emp. Form.C20H18N6O
Mol. Mass.358.3965
SMILESCc1cc(ccn1)-c1n[nH]c2cc(NC(=O)NCc3ccccc3)ncc12