Reaction Details
TargetMitogen-activated protein kinase 1
LigandBDBM157340
Substrate/Competitorn/a
Meas. Tech.IMAP-FP Assay
IC50 0.2171±n/a nM
Citation Lim, JKelley, EHMethot, JLZhou, HPetrocchi, AMansoor, UFFischer, CO'Boyle, BGuerin, DJBienstock, CEBoyce, CWDaniels, MHFalcone, DFerguson, RDFevrier, SHuang, XLipford, KASloman, DLWilson, KZhou, WWitter, DMaletic, MMSiliphaivanh, P Compounds that are ERK inhibitors US Patent US9023865 Publication Date 5/5/2015
 
Mitogen-activated protein kinase 1
Name:Mitogen-activated protein kinase 1
Type:Ser/Thr Protein Kinase
Mol. Mass.:41392.76
Organism:Homo sapiens (Human)
Description:P28482
Residue:360
BDBM157340
NameBDBM157340
Synonyms:BDBM157741 | US9023865, 181
TypeSmall organic molecule
Emp. Form.C24H25N7O
Mol. Mass.427.5016
SMILESCN1C[C@@H](NC(=O)Nc2cc3[nH]nc(-c4ccnc(C)c4)c3cn2)[C@@H](C1)c1ccccc1