Reaction Details
TargetMitogen-activated protein kinase 1
LigandBDBM157520
Substrate/Competitorn/a
Meas. Tech.IMAP-FP Assay
IC50 0.2316±n/a nM
Citation Lim, JKelley, EHMethot, JLZhou, HPetrocchi, AMansoor, UFFischer, CO'Boyle, BGuerin, DJBienstock, CEBoyce, CWDaniels, MHFalcone, DFerguson, RDFevrier, SHuang, XLipford, KASloman, DLWilson, KZhou, WWitter, DMaletic, MMSiliphaivanh, P Compounds that are ERK inhibitors US Patent US9023865 Publication Date 5/5/2015
 
Mitogen-activated protein kinase 1
Name:Mitogen-activated protein kinase 1
Type:Ser/Thr Protein Kinase
Mol. Mass.:41392.76
Organism:Homo sapiens (Human)
Description:P28482
Residue:360
BDBM157520
NameBDBM157520
Synonyms:US9023865, 361
TypeSmall organic molecule
Emp. Form.C21H21N7O
Mol. Mass.387.4377
SMILESCc1cc(ccn1)-c1n[nH]c2cc(NC(=O)NC(CN)c3ccccc3)ncc12