Reaction Details
TargetMitogen-activated protein kinase 1
LigandBDBM157697
Substrate/Competitorn/a
Meas. Tech.IMAP-FP Assay
IC50 0.2983±n/a nM
Citation Lim, JKelley, EHMethot, JLZhou, HPetrocchi, AMansoor, UFFischer, CO'Boyle, BGuerin, DJBienstock, CEBoyce, CWDaniels, MHFalcone, DFerguson, RDFevrier, SHuang, XLipford, KASloman, DLWilson, KZhou, WWitter, DMaletic, MMSiliphaivanh, P Compounds that are ERK inhibitors US Patent US9023865 Publication Date 5/5/2015
 
Mitogen-activated protein kinase 1
Name:Mitogen-activated protein kinase 1
Type:Ser/Thr Protein Kinase
Mol. Mass.:41392.76
Organism:Homo sapiens (Human)
Description:P28482
Residue:360
BDBM157697
NameBDBM157697
Synonyms:US9023865, 538
TypeSmall organic molecule
Emp. Form.C22H22N6O2
Mol. Mass.402.4491
SMILESCOC[C@@H](NC(=O)Nc1cc2[nH]nc(-c3ccnc(C)c3)c2cn1)c1ccccc1