Reaction Details
TargetMitogen-activated protein kinase 1
LigandBDBM157704
Substrate/Competitorn/a
Meas. Tech.IMAP-FP Assay
IC50 0.2357±n/a nM
Citation Lim, JKelley, EHMethot, JLZhou, HPetrocchi, AMansoor, UFFischer, CO'Boyle, BGuerin, DJBienstock, CEBoyce, CWDaniels, MHFalcone, DFerguson, RDFevrier, SHuang, XLipford, KASloman, DLWilson, KZhou, WWitter, DMaletic, MMSiliphaivanh, P Compounds that are ERK inhibitors US Patent US9023865 Publication Date 5/5/2015
 
Mitogen-activated protein kinase 1
Name:Mitogen-activated protein kinase 1
Type:Ser/Thr Protein Kinase
Mol. Mass.:41392.76
Organism:Homo sapiens (Human)
Description:P28482
Residue:360
BDBM157704
NameBDBM157704
Synonyms:US9023865, 545
TypeSmall organic molecule
Emp. Form.C21H20N6O2
Mol. Mass.388.4225
SMILESCOC[C@@H](NC(=O)Nc1cc2[nH]nc(-c3ccncc3)c2cn1)c1ccccc1