Reaction Details
TargetMitogen-activated protein kinase 1
LigandBDBM157740
Substrate/Competitorn/a
Meas. Tech.IMAP-FP Assay
IC50 0.233±n/a nM
Citation Lim, JKelley, EHMethot, JLZhou, HPetrocchi, AMansoor, UFFischer, CO'Boyle, BGuerin, DJBienstock, CEBoyce, CWDaniels, MHFalcone, DFerguson, RDFevrier, SHuang, XLipford, KASloman, DLWilson, KZhou, WWitter, DMaletic, MMSiliphaivanh, P Compounds that are ERK inhibitors US Patent US9023865 Publication Date 5/5/2015
 
Mitogen-activated protein kinase 1
Name:Mitogen-activated protein kinase 1
Type:Ser/Thr Protein Kinase
Mol. Mass.:41392.76
Organism:Homo sapiens (Human)
Description:P28482
Residue:360
BDBM157740
NameBDBM157740
Synonyms:US9023865, 581
TypeSmall organic molecule
Emp. Form.C24H24ClN7O
Mol. Mass.461.947
SMILESCN1C[C@@H](NC(=O)Nc2cc3[nH]nc(-c4ccnc(C)c4)c3cn2)[C@@H](C1)c1cccc(Cl)c1