Reaction Details
TargetTyrosine-protein kinase JAK2
LigandBDBM159770
Substrate/Competitorn/a
Meas. Tech.Enzyme Assay
pH7.4±n/a
Temperature298.15±n/a K
IC50 52±n/a nM
Commentsextracted
Citation Brown, MFFenwick, AEFlanagan, MEGonzales, AJohnson, TAKaila, NMitton-Fry, MJStrohbach, JWTenBrink, RETrzupek, JDUnwalla, RJVazquez, MLParikh, MD Pyrrolo[2,3-D]pyrimidine derivatives US Patent US9035074 Publication Date 5/19/2015
 
Tyrosine-protein kinase JAK2
Name:Tyrosine-protein kinase JAK2
Type:Protein
Mol. Mass.:130684.68
Organism:Homo sapiens (Human)
Description:O60674
Residue:1132
BDBM159770
NameBDBM159770
Synonyms:US10966980, Example 21 | US9035074, 21
TypeSmall organic molecule
Emp. Form.C19H26N8O2S
Mol. Mass.430.527
SMILESCN([C@@H]1C[C@@H](C1)NS(=O)(=O)N1CCC(CC1)c1cc[nH]n1)c1ncnc2[nH]ccc12