Reaction Details
TargetEpidermal growth factor receptor [668-1210,T790M,L858R]
LigandBDBM50029668
Substrate/Competitorn/a
Meas. Tech.ssay of Inhibitory Activity on Wild Type EGFR and Mutant EGFR Kinase
Temperature298.15±n/a K
IC50 2.00±n/a nM
Commentsextracted
Citation Jin, YBu, PHe, QLan, JZhou, FZhang, LHe, X Azabicyclo derivatives, process for preparation thereof and medical use thereof US Patent US10085983 Publication Date 10/2/2018
 
Epidermal growth factor receptor [668-1210,T790M,L858R]
Name:Epidermal growth factor receptor [668-1210,T790M,L858R]
Type:Enzyme
Mol. Mass.:61378.18
Organism:Homo sapiens (Human)
Description:a.a: 668-1210
Residue:543
BDBM50029668
NameBDBM50029668
Synonyms:AZD-9291 US10085983, Compound AZD-9291 US11111233, Example AZD9291 US20230322822, Compound AZD9291 WO2022090481, Example osimertinib
TypeSmall organic molecule
Emp. Form.C28H33N7O2
Mol. Mass.499.6073
SMILESCOc1cc(N(C)CCN(C)C)c(NC(=O)C=C)cc1Nc1nccc(n1)-c1cn(C)c2ccccc12