Reaction Details
TargetBifunctional ligase/repressor BirA
LigandBDBM161467
Substrate/Competitorn/a
Meas. Tech.Enzyme Inhibition Assay
pH8±n/a
Temperature310.15±n/a K
Ki 1830±n/a nM
IC50 11600±n/a nM
Commentsextracted
Citation Abell, APolyak, SBooker, GWallace, JSoares da Costa, TJarrad, ATieu, WKeeling, KLPedersen, DSPendini, NWilce, MYap, MY Antimicrobial compounds US Patent US9108978 Publication Date 8/18/2015
 
Bifunctional ligase/repressor BirA
Name:Bifunctional ligase/repressor BirA
Type:Protein
Mol. Mass.:37140.09
Organism:Staphylococcus aureus
Description:W8TTE7
Residue:323
BDBM161467
NameBDBM161467
Synonyms:US9108978, 3.25
TypeSmall organic molecule
Emp. Form.C25H34N10O4S
Mol. Mass.570.667
SMILESCC1(C)O[C@H]2[C@H](Cn3cc(CCCCC[C@@H]4SC[C@@H]5NC(=O)N[C@H]45)nn3)O[C@@H]([C@H]2O1)n1cnc2c(N)ncnc12