Reaction Details
TargetBifunctional ligase/repressor BirA
LigandBDBM161470
Substrate/Competitorn/a
Meas. Tech.Enzyme Inhibition Assay
pH8±n/a
Temperature310.15±n/a K
Ki 660±n/a nM
IC50 4000±n/a nM
Commentsextracted
Citation Abell, APolyak, SBooker, GWallace, JSoares da Costa, TJarrad, ATieu, WKeeling, KLPedersen, DSPendini, NWilce, MYap, MY Antimicrobial compounds US Patent US9108978 Publication Date 8/18/2015
 
Bifunctional ligase/repressor BirA
Name:Bifunctional ligase/repressor BirA
Type:Protein
Mol. Mass.:37140.09
Organism:Staphylococcus aureus
Description:W8TTE7
Residue:323
BDBM161470
NameBDBM161470
Synonyms:US9108978, 4.01
TypeSmall organic molecule
Emp. Form.C21H30N10OS
Mol. Mass.470.594
SMILESNc1ncnc2n(CCCCn3cc(CCCCC[C@@H]4SC[C@@H]5NC(=O)N[C@H]45)nn3)cnc12