Reaction Details
TargetBifunctional ligase/repressor BirA
LigandBDBM161471
Substrate/Competitorn/a
Meas. Tech.Enzyme Inhibition Assay
pH8±n/a
Temperature310.15±n/a K
Ki>10000±n/a nM
IC50>50000±n/a nM
Commentsextracted
Citation Abell, APolyak, SBooker, GWallace, JSoares da Costa, TJarrad, ATieu, WKeeling, KLPedersen, DSPendini, NWilce, MYap, MY Antimicrobial compounds US Patent US9108978 Publication Date 8/18/2015
 
Bifunctional ligase/repressor BirA
Name:Bifunctional ligase/repressor BirA
Type:Protein
Mol. Mass.:37140.09
Organism:Staphylococcus aureus
Description:W8TTE7
Residue:323
BDBM161471
NameBDBM161471
Synonyms:US9108978, 6.34
TypeSmall organic molecule
Emp. Form.C22H31N3O7PS
Mol. Mass.512.537
SMILESCc1ccc2oc(=O)n(CCCCOP([O-])(=O)OCCCCC[C@@H]3SC[C@@H]4NC(=O)N[C@H]34)c2c1