Reaction Details
TargetBifunctional ligase/repressor BirA
LigandBDBM161472
Substrate/Competitorn/a
Meas. Tech.Enzyme Inhibition Assay
pH8±n/a
Temperature310.15±n/a K
Ki 30±n/a nM
IC50 203±n/a nM
Commentsextracted
Citation Abell, APolyak, SBooker, GWallace, JSoares da Costa, TJarrad, ATieu, WKeeling, KLPedersen, DSPendini, NWilce, MYap, MY Antimicrobial compounds US Patent US9108978 Publication Date 8/18/2015
 
Bifunctional ligase/repressor BirA
Name:Bifunctional ligase/repressor BirA
Type:Protein
Mol. Mass.:37140.09
Organism:Staphylococcus aureus
Description:W8TTE7
Residue:323
BDBM161472
NameBDBM161472
Synonyms:US9108978, 2.02
TypeSmall organic molecule
Emp. Form.C20H29N7O8PS
Mol. Mass.558.526
SMILESNc1ncnc2n(cnc12)[C@@H]1O[C@H](COP([O-])(=O)OCCCCC[C@@H]2SC[C@@H]3NC(=O)N[C@H]23)[C@@H](O)[C@H]1O