Reaction Details
TargetE3 ubiquitin-protein ligase Mdm2
LigandBDBM161878
Substrate/Competitorn/a
Meas. Tech.Time Resolved Fluorescence Energy Transfer (TR-FRET) Assay
IC50 10.7±n/a nM
Citation Berghausen, JBuschmann, NFuret, PGessier, FHergovich Lisztwan, JHolzer, PJacoby, EKallen, JMasuya, KPissot Soldermann, CRen, HStutz, S Substituted isoquinolinones and quinazolinones US Patent US9051279 Publication Date 6/9/2015
 
E3 ubiquitin-protein ligase Mdm2
Name:E3 ubiquitin-protein ligase Mdm2
Type:Oncoprotein
Mol. Mass.:55196.54
Organism:Homo sapiens (Human)
Description:Q00987
Residue:491
BDBM161878
NameBDBM161878
Synonyms:US9051279, 49
TypeSmall organic molecule
Emp. Form.C34H42ClN3O5S
Mol. Mass.640.232
SMILESCC[C@@H](C)Oc1cc2C(N(C(=O)Cc2cc1OC)c1ccc(cc1)N(C)CC1CCN(CC1)S(C)(=O)=O)c1ccc(Cl)cc1