Reaction Details
TargetE3 ubiquitin-protein ligase Mdm2
LigandBDBM162023
Substrate/Competitorn/a
Meas. Tech.Time Resolved Fluorescence Energy Transfer (TR-FRET) Assay
IC50 1.9±n/a nM
Citation Berghausen, JBuschmann, NFuret, PGessier, FHergovich Lisztwan, JHolzer, PJacoby, EKallen, JMasuya, KPissot Soldermann, CRen, HStutz, S Substituted isoquinolinones and quinazolinones US Patent US9051279 Publication Date 6/9/2015
 
E3 ubiquitin-protein ligase Mdm2
Name:E3 ubiquitin-protein ligase Mdm2
Type:Oncoprotein
Mol. Mass.:55196.54
Organism:Homo sapiens (Human)
Description:Q00987
Residue:491
BDBM162023
NameBDBM162023
Synonyms:US9051279, 73a | US9051279, 73b
TypeSmall organic molecule
Emp. Form.C36H46ClN3O3
Mol. Mass.604.222
SMILESCC[C@@H](C)Oc1cc2[C@@H](N(C(=O)Cc2cc1OC)c1ccc(cc1)N(C)C[C@H]1CC[C@@H](CC1)N(C)C)c1ccc(Cl)cc1