Reaction Details
TargetProtein Mdm4
LigandBDBM161864
Substrate/Competitorn/a
Meas. Tech.Time Resolved Fluorescence Energy Transfer (TR-FRET) Assay
IC50 19320±n/a nM
Citation Berghausen, JBuschmann, NFuret, PGessier, FHergovich Lisztwan, JHolzer, PJacoby, EKallen, JMasuya, KPissot Soldermann, CRen, HStutz, S Substituted isoquinolinones and quinazolinones US Patent US9051279 Publication Date 6/9/2015
 
Protein Mdm4
Name:Protein Mdm4
Type:Oncoprotein
Mol. Mass.:54842.04
Organism:Homo sapiens (Human)
Description:The HDMX(1-188) were expressed in Escherichia coli BL21 (DE3) as a GST fusion and purified on glutathione sepharose.
Residue:490
BDBM161864
NameBDBM161864
Synonyms:US9051279, 42
TypeSmall organic molecule
Emp. Form.C33H34ClN3O3
Mol. Mass.556.094
SMILESCC[C@@H](C)Oc1cc2C(N(C(=O)Cc2cc1OC)c1ccc(cc1)N(C)Cc1ccncc1)c1ccc(Cl)cc1