Reaction Details
TargetProtein Mdm4
LigandBDBM162166
Substrate/Competitorn/a
Meas. Tech.Time Resolved Fluorescence Energy Transfer (TR-FRET) Assay
IC50 4130±n/a nM
Citation Berghausen, JBuschmann, NFuret, PGessier, FHergovich Lisztwan, JHolzer, PJacoby, EKallen, JMasuya, KPissot Soldermann, CRen, HStutz, S Substituted isoquinolinones and quinazolinones US Patent US9051279 Publication Date 6/9/2015
 
Protein Mdm4
Name:Protein Mdm4
Type:Oncoprotein
Mol. Mass.:54842.04
Organism:Homo sapiens (Human)
Description:The HDMX(1-188) were expressed in Escherichia coli BL21 (DE3) as a GST fusion and purified on glutathione sepharose.
Residue:490
BDBM162166
NameBDBM162166
Synonyms:US9051279, 149
TypeSmall organic molecule
Emp. Form.C35H43ClN6O4
Mol. Mass.647.207
SMILESCOc1cc2CC(=O)N([C@@H](c3ccc(Cl)cc3)c2cc1OC(C)C)c1cnc(cn1)N(C)C[C@H]1CC[C@@H](CC1)N1CN(C)C(=O)C1