Reaction Details
TargetHistone deacetylase 8
LigandBDBM163619
Substrate/Competitorn/a
Meas. Tech.HDAC Activity Assays
IC50 2.83e+3±n/a nM
Citation Wang, YStowe, RLPinello, CETian, GMadoux, FLi, DZhao, LYLi, JLWang, YWang, YMa, HHodder, PRoush, WRLiao, D Identification of histone deacetylase inhibitors with benzoylhydrazide scaffold that selectively inhibit class I histone deacetylases. Chem Biol22:273-84 (2015) 
 
Histone deacetylase 8
Name:Histone deacetylase 8
Type:Enzyme
Mol. Mass.:41749.60
Organism:Homo sapiens (Human)
Description:Q9BY41
Residue:377
BDBM163619
NameBDBM163619
Synonyms:UF010 US11731934, Compound UF010
TypeSmall organic molecule
Emp. Form.C11H15BrN2O
Mol. Mass.271.154
SMILESCCCCNNC(=O)c1ccc(Br)cc1