Reaction Details
TargetBeta-galactosidase
LigandBDBM163636
Substrate/Competitorn/a
Meas. Tech.Inhibition Assays
Ki 1.4e+3± 4e+2 nM
Citation Wallace, BDRoberts, ABPollet, RMIngle, JDBiernat, KAPellock, SJVenkatesh, MKGuthrie, LO'Neal, SKRobinson, SJDollinger, MFigueroa, EMcShane, SRCohen, RDJin, JFrye, SVZamboni, WCPepe-Ranney, CMani, SKelly, LRedinbo, MR Structure and Inhibition of Microbiome ß-Glucuronidases Essential to the Alleviation of Cancer Drug Toxicity. Chem Biol22:1238-49 (2015) 
 
Beta-galactosidase
Name:Beta-galactosidase
Synonyms:Beta-glucuronidase (SaGUS)
Type:Protein
Mol. Mass.:69235.31
Organism:Streptococcus agalactiae (Firmicutes)
Description:A0A0E1EGE5
Residue:599
BDBM163636
NameBDBM163636
TypeSmall organic molecule
Emp. Form.C23H27N3O3S
Mol. Mass.425.544
SMILESCCOc1ccc(NC(=S)N(CCO)Cc2cc3cc(C)cc(C)c3[nH]c2=O)cc1