Reaction Details
TargetBeta-galactosidase [V151I,I185V]
LigandBDBM163638
Substrate/Competitorn/a
Meas. Tech.Inhibition Assays
Ki 7.8e+3± 9e+2 nM
Citation Wallace, BDRoberts, ABPollet, RMIngle, JDBiernat, KAPellock, SJVenkatesh, MKGuthrie, LO'Neal, SKRobinson, SJDollinger, MFigueroa, EMcShane, SRCohen, RDJin, JFrye, SVZamboni, WCPepe-Ranney, CMani, SKelly, LRedinbo, MR Structure and Inhibition of Microbiome ß-Glucuronidases Essential to the Alleviation of Cancer Drug Toxicity. Chem Biol22:1238-49 (2015) 
 
Beta-galactosidase [V151I,I185V]
Name:Beta-galactosidase [V151I,I185V]
Type:Protein
Mol. Mass.:68709.58
Organism:Clostridium perfringens (Firmicutes)
Description:A0A0N9KAE4
Residue:599
BDBM163638
NameBDBM163638
Synonyms:1(2Fluorophenyl)3(2hydroxyethyl)3[(6methyl2oxo1,2dihydroquinolin3yl)methyl]thiourea (Inh 3)
TypeSmall organic molecule
Emp. Form.C20H20FN3O2S
Mol. Mass.385.455
SMILESCc1ccc2[nH]c(=O)c(CN(CCO)C(=S)Nc3ccccc3F)cc2c1